Reaction Details
TargetSubstance-K receptor
LigandBDBM50290462
Substrate/Competitorn/a
Meas. Tech.ChEMBL_142717 (CHEMBL744868)
Ki 2400±n/a nM
Citation Fauchère, JLKucharczyk, NJacoby, ELonchampt, MRobineau, PDacquet, CRegoli, DCanet, E The dipeptide neurokinin-1 receptor antagonist S19752 is a potent and long-acting inhibitor of bronchoconstriction when administered by aerosol to the guinea pig in vivo Bioorg Med Chem Lett7:203-208 (1997)    Article
 
Substance-K receptor
Name:Substance-K receptor
Type:Protein
Mol. Mass.:44455.78
Organism:Homo sapiens (Human)
Description:P21452
Residue:398
BDBM50290462
NameBDBM50290462
Synonyms:CHEMBL305119 | potassium 2N-[1-benzyl(methyl)carbamoyl-2-(2-naphthyl)-(1S)-ethyl]-4-hydroxy-1-{1-[4-(1H-1,2,3,4-tetraazol-5-yl)butyl]-1H-3-indolylcarbonyl}-(2R,4S)-tetrahydro-1H-2-pyrrolecarboxamide
TypeSmall organic molecule
Emp. Form.C40H41N8O4
Mol. Mass.697.8053
SMILESCN(Cc1ccccc1)C(=O)C(Cc1ccc2ccccc2c1)NC(=O)C1CC(O)CN1C(=O)c1cn(CCCCc2nn[n-]n2)c2ccccc12