Reaction Details
TargetSubstance-K receptor
LigandBDBM50290461
Substrate/Competitorn/a
Meas. Tech.ChEBML_142721
Ki 5.2±n/a nM
Citation Fauchère, JLKucharczyk, NJacoby, ELonchampt, MRobineau, PDacquet, CRegoli, DCanet, E The dipeptide neurokinin-1 receptor antagonist S19752 is a potent and long-acting inhibitor of bronchoconstriction when administered by aerosol to the guinea pig in vivo Bioorg Med Chem Lett7:203-208 (1997)    Article
 
Substance-K receptor
Name:Substance-K receptor
Type:n/a
Mol. Mass.:43141.28
Organism:Oryctolagus cuniculus
Description:n/a
Residue:384
BDBM50290461
NameBDBM50290461
Synonyms:CHEMBL65468 | potassium 3,5-di(trifluoromethyl)benzyl 2-[4-hydroxy-1-{1-[4-(1H-1,2,3,4-tetraazol-5-yl)butyl]-1H-3-indolylcarbonyl}-(2R,4S)-tetrahydro-1H-2-pyrrolylcarboxamido]-3-(1H-3-indolyl)-(2S)-propanoate
TypeSmall organic molecule
Emp. Form.C39H35F6N8O5
Mol. Mass.809.7368
SMILESOC1CC(N(C1)C(=O)c1cn(CCCCc2nn[n-]n2)c2ccccc12)C(=O)NC(Cc1c[nH]c2ccccc12)C(=O)OCc1cc(cc(c1)C(F)(F)F)C(F)(F)F