Reaction Details
TargetB1 bradykinin receptor
LigandBDBM50214792
Substrate/Competitorn/a
Meas. Tech.ChEMBL_39983 (CHEMBL653557)
EC50 85±n/a nM
Citation Tancredi, MGaloppini, CMeini, SQuartara, LMaggi, CARovero, P Synthesis and biological activity of new bradykinin pseudopeptide B1 receptor agonists containing alkylic spacers Bioorg Med Chem Lett7:2661-2664 (1997)    Article
 
B1 bradykinin receptor
Name:B1 bradykinin receptor
Type:Enzyme Catalytic Domain
Mol. Mass.:38389.97
Organism:RAT
Description:B1 BRADYKININ BDKRB1 RAT::P97583
Residue:337
BDBM50214792
NameBDBM50214792
Synonyms:CHEMBL264100 | des-Arg10-Kallidin
TypeSmall organic molecule
Emp. Form.C50H73N13O11
Mol. Mass.1032.1951
SMILESNCCCC[C@H](N)C(=O)N[C@@H](CCCN=C(N)N)C(=O)N1CCC[C@H]1C(=O)N1CCC[C@H]1C(=O)NCC(=O)N[C@@H](Cc1ccccc1)C(=O)N[C@@H](CO)C(=O)N1CCC[C@H]1C(=O)N[C@@H](Cc1ccccc1)C(O)=O