Reaction Details
TargetNeuronal acetylcholine receptor subunit alpha-4/beta-2
LigandBDBM50035398
Substrate/Competitorn/a
Meas. Tech.ChEMBL_217302 (CHEMBL823923)
EC50 10600±n/a nM
Citation Elliott, RLRyther, KBAnderson, DJPiattoni-Kaplan, MKuntzweiler, TADonnelly-Roberts, DArneric, SPHolladay, MW Novel 2-(2′-furo[3,2-b]pyridinyl) pyrrolidines: potent neuronal nicotinic acetylcholine receptor ligands Bioorg Med Chem Lett7:2703-2708 (1997)    Article
 
Neuronal acetylcholine receptor subunit alpha-4/beta-2
Name:Neuronal acetylcholine receptor subunit alpha-4/beta-2
Type:Protein
Mol. Mass.:n/a
Description:n/a
Components:This complex has 2 components.
Component 1
Name:Neuronal acetylcholine receptor subunit alpha-4
Synonyms:ACHA4_HUMAN CHRNA4 protein Neuronal acetylcholine receptor protein alpha-4 subunit Nicotinic acetylcholine receptor alpha4/beta2/alpha5
Type:n/a
Mol. Mass.:69963.49
Organism:Homo sapiens (Human)
Description:NACHRA4
Residue:627
Component 2
Name:Neuronal acetylcholine receptor subunit beta-2
Synonyms:ACHB2_HUMAN Neuronal acetylcholine receptor protein beta-2 subunit | Nicotinic acetylcholine receptor alpha3/beta2/alpha5
Type:Protein
Mol. Mass.:57020.50
Organism:Homo sapiens (Human)
Description:P17787
Residue:502
BDBM50035398
NameBDBM50035398
Synonyms:(S)-1-Methyl-2-(3-methyl-isoxazol-5-yl)-pyrrolidinium 3-Methyl-5-((S)-1-methyl-pyrrolidin-2-yl)-isoxazole CHEMBL274525
TypeSmall organic molecule
Emp. Form.C9H14N2O
Mol. Mass.166.2203
SMILESCN1CCC[C@H]1c1cc(C)no1