Reaction Details
TargetAcetylcholine receptor subunit alpha
LigandBDBM82070
Substrate/Competitorn/a
Meas. Tech.ChEBML_223071
EC50 180000±n/a nM
Citation Elliott, RLRyther, KBAnderson, DJPiattoni-Kaplan, MKuntzweiler, TADonnelly-Roberts, DArneric, SPHolladay, MW Novel 2-(2′-furo[3,2-b]pyridinyl) pyrrolidines: potent neuronal nicotinic acetylcholine receptor ligands Bioorg Med Chem Lett7:2703-2708 (1997)    Article
 
Acetylcholine receptor subunit alpha
Name:Acetylcholine receptor subunit alpha
Type:Ion channel
Mol. Mass.:54542.01
Organism:Homo sapiens (Human)
Description:n/a
Residue:482
BDBM82070
NameBDBM82070
Synonyms:CAS_29790-52-1 Nicotine-D salicylate US9303017, Nicotine
Typen/a
Emp. Form.C10H14N2
Mol. Mass.162.2316
SMILESCN1CCC[C@H]1c1cccnc1