Reaction Details
TargetRetinoic acid receptor RXR-gamma
LigandBDBM50290659
Substrate/Competitorn/a
Meas. Tech.ChEMBL_196650 (CHEMBL800763)
EC50 24±n/a nM
Citation Farmer, LJZhi, LJeong, SKallel, EACroston, GFlatten, KSHeyman, RANadzan, AM Synthesis and structure-activity relationships of potent conformationally restricted retinoid X receptor ligands Bioorg Med Chem Lett7:2747-2752 (1997)    Article
 
Retinoic acid receptor RXR-gamma
Name:Retinoic acid receptor RXR-gamma
Type:PROTEIN
Mol. Mass.:50878.26
Organism:Homo sapiens (Human)
Description:ChEMBL_197216
Residue:463
BDBM50290659
NameBDBM50290659
Synonyms:(2E,4E)-3-Methyl-5-[1-(5,5,8,8-tetramethyl-5,6,7,8-tetrahydro-naphthalen-2-yl)-cyclopropyl]-penta-2,4-dienoic acid | CHEMBL93518
TypeSmall organic molecule
Emp. Form.C23H30O2
Mol. Mass.338.4831
SMILESC\C(\C=C\C1(CC1)c1ccc2c(c1)C(C)(C)CCC2(C)C)=C/C(O)=O