Reaction Details
TargetRetinoic acid receptor gamma
LigandBDBM50033079
Substrate/Competitorn/a
Meas. Tech.ChEBML_196331
Ki 887±n/a nM
Citation Farmer, LJZhi, LJeong, SKallel, EACroston, GFlatten, KSHeyman, RANadzan, AM Synthesis and structure-activity relationships of potent conformationally restricted retinoid X receptor ligands Bioorg Med Chem Lett7:2747-2752 (1997)    Article
 
Retinoic acid receptor gamma
Name:Retinoic acid receptor gamma
Type:PROTEIN
Mol. Mass.:50345.43
Organism:Homo sapiens (Human)
Description:ChEMBL_1458016
Residue:454
BDBM50033079
NameBDBM50033079
Synonyms:4-[1-(5,5,8,8-Tetramethyl-5,6,7,8-tetrahydro-naphthalen-2-yl)-vinyl]-benzoic acid | CHEMBL96184
TypeSmall organic molecule
Emp. Form.C23H26O2
Mol. Mass.334.4513
SMILESCC1(C)CCC(C)(C)c2cc(ccc12)C(=C)c1ccc(cc1)C(O)=O