Reaction Details
TargetNeutrophil collagenase
LigandBDBM50290668
Substrate/Competitorn/a
Meas. Tech.ChEBML_102109
IC50 19±n/a nM
Citation Baxter, ADBhogal, RBird, JBBuckley, GMGregory, DSHedger, PCManallack, DTMassil, TMinton, KJMontana, JGNeidle, SOwen, DAWatson, RJ Mercaptoacyl matrix metalloproteinase inhibitors: The effect of substitution at the mercaptoacyl moiety Bioorg Med Chem Lett7:2765-2770 (1997)    Article
 
Neutrophil collagenase
Name:Neutrophil collagenase
Type:Enzyme
Mol. Mass.:53413.48
Organism:Homo sapiens (Human)
Description:P22894
Residue:467
BDBM50290668
NameBDBM50290668
Synonyms:2-Mercapto-5-methanesulfonylamino-pentanoic acid [(S)-3-methyl-1-((S)-1-methylcarbamoyl-2-phenyl-ethylcarbamoyl)-butyl]-amide | CHEMBL94256
TypeSmall organic molecule
Emp. Form.C22H36N4O5S2
Mol. Mass.500.675
SMILESCNC(=O)[C@H](Cc1ccccc1)NC(=O)[C@H](CC(C)C)NC(=O)C(S)CCCNS(C)(=O)=O