Reaction Details
TargetNeutrophil collagenase
LigandBDBM50290676
Substrate/Competitorn/a
Meas. Tech.ChEBML_102109
IC50 80±n/a nM
Citation Baxter, ADBhogal, RBird, JBBuckley, GMGregory, DSHedger, PCManallack, DTMassil, TMinton, KJMontana, JGNeidle, SOwen, DAWatson, RJ Mercaptoacyl matrix metalloproteinase inhibitors: The effect of substitution at the mercaptoacyl moiety Bioorg Med Chem Lett7:2765-2770 (1997)    Article
 
Neutrophil collagenase
Name:Neutrophil collagenase
Type:Enzyme
Mol. Mass.:53413.48
Organism:Homo sapiens (Human)
Description:P22894
Residue:467
BDBM50290676
NameBDBM50290676
Synonyms:(S)-2-(2-Mercapto-4-phenyl-butyrylamino)-4-methyl-pentanoic acid ((S)-1-methylcarbamoyl-2-phenyl-ethyl)-amide | CHEMBL431268
TypeSmall organic molecule
Emp. Form.C26H35N3O3S
Mol. Mass.469.639
SMILESCNC(=O)[C@H](Cc1ccccc1)NC(=O)[C@H](CC(C)C)NC(=O)C(S)CCc1ccccc1