Reaction Details
TargetSubstance-P receptor
LigandBDBM50290707
Substrate/Competitorn/a
Meas. Tech.ChEBML_205406
IC50 5.9±n/a nM
Citation Vaz, RJMaynard, GDKudlacz, EMBratton, LDKane, JMShatzer, SAKnippenberg, RW Use of CoMFA in validating the conformation used in designing 4-(1H-benzimidazole-2-carbonyl)piperidines with H1/NK1 receptor antagonist activity Bioorg Med Chem Lett7:2825-2830 (1997)    Article
 
Substance-P receptor
Name:Substance-P receptor
Type:Enzyme Catalytic Domain
Mol. Mass.:46261.42
Organism:GUINEA PIG
Description:Neurokinin NK1 TACR1 GUINEA PIG::P30547
Residue:407
BDBM50290707
NameBDBM50290707
Synonyms:CHEMBL330367 [3-(3,4-Dimethoxy-phenyl)-3-(2-{4-[1-(4-fluoro-benzyl)-1H-benzoimidazole-2-carbonyl]-piperidin-1-yl}-ethyl)-pyrrolidin-1-yl]-(3,4,5-triethoxy-phenyl)-methanone; compound with (E)-but-2-enedioic acid
TypeSmall organic molecule
Emp. Form.C47H55FN4O7
Mol. Mass.806.9606
SMILESCCOc1cc(cc(OCC)c1OCC)C(=O)N1CCC(CCN2CCC(CC2)C(=O)c2nc3ccccc3n2Cc2ccc(F)cc2)(C1)c1ccc(OC)c(OC)c1