Reaction Details
TargetPlatelet-derived growth factor receptor beta
LigandBDBM50290839
Substrate/Competitorn/a
Meas. Tech.ChEBML_177425
IC50 8400±n/a nM
Citation Kubo, KShimizu, TOhyama, SiMurooka, HNishitoba, TKato, SKobayashi, YYagi, MIsoe, TNakamura, KOsawa, TIzawa, T A novel series of 4-phenoxyquinolines: potent and highly selective inhibitors of PDGF receptor autophosphorylation Bioorg Med Chem Lett7:2935-2940 (1997)    Article
 
Platelet-derived growth factor receptor beta
Name:Platelet-derived growth factor receptor beta
Type:PROTEIN
Mol. Mass.:122794.58
Organism:Rattus norvegicus
Description:ChEMBL_177425
Residue:1097
BDBM50290839
NameBDBM50290839
Synonyms:4-(3-Bromo-phenoxy)-6,7-dimethoxy-quinoline | CHEMBL101581
TypeSmall organic molecule
Emp. Form.C17H14BrNO3
Mol. Mass.360.202
SMILESCOc1cc2nccc(Oc3cccc(Br)c3)c2cc1OC