Reaction Details
TargetPlatelet-derived growth factor receptor beta
LigandBDBM50290835
Substrate/Competitorn/a
Meas. Tech.ChEBML_177425
IC50 4500±n/a nM
Citation Kubo, KShimizu, TOhyama, SiMurooka, HNishitoba, TKato, SKobayashi, YYagi, MIsoe, TNakamura, KOsawa, TIzawa, T A novel series of 4-phenoxyquinolines: potent and highly selective inhibitors of PDGF receptor autophosphorylation Bioorg Med Chem Lett7:2935-2940 (1997)    Article
 
Platelet-derived growth factor receptor beta
Name:Platelet-derived growth factor receptor beta
Type:PROTEIN
Mol. Mass.:122794.58
Organism:Rattus norvegicus
Description:ChEMBL_177425
Residue:1097
BDBM50290835
NameBDBM50290835
Synonyms:(3,4-Dimethoxy-phenyl)-(6,7-dimethoxy-quinazolin-4-yl)-amine CHEMBL544833
TypeSmall organic molecule
Emp. Form.C18H19N3O4
Mol. Mass.341.3612
SMILESCOc1ccc(Nc2ncnc3cc(OC)c(OC)cc23)cc1OC