Reaction Details
TargetPlatelet-derived growth factor receptor beta
LigandBDBM50290854
Substrate/Competitorn/a
Meas. Tech.ChEBML_177425
IC50 69300±n/a nM
Citation Kubo, KShimizu, TOhyama, SiMurooka, HNishitoba, TKato, SKobayashi, YYagi, MIsoe, TNakamura, KOsawa, TIzawa, T A novel series of 4-phenoxyquinolines: potent and highly selective inhibitors of PDGF receptor autophosphorylation Bioorg Med Chem Lett7:2935-2940 (1997)    Article
 
Platelet-derived growth factor receptor beta
Name:Platelet-derived growth factor receptor beta
Type:PROTEIN
Mol. Mass.:122794.58
Organism:Rattus norvegicus
Description:ChEMBL_177425
Residue:1097
BDBM50290854
NameBDBM50290854
Synonyms:4-(2,6-Dimethoxy-phenoxy)-6,7-dimethoxy-quinoline | CHEMBL316662
TypeSmall organic molecule
Emp. Form.C19H19NO5
Mol. Mass.341.3579
SMILESCOc1cc2nccc(Oc3c(OC)cccc3OC)c2cc1OC