Reaction Details
TargetEpidermal growth factor receptor
LigandBDBM50290834
Substrate/Competitorn/a
Meas. Tech.ChEMBL_63613 (CHEMBL676157)
IC50>100000±n/a nM
Citation Kubo, KShimizu, TOhyama, SiMurooka, HNishitoba, TKato, SKobayashi, YYagi, MIsoe, TNakamura, KOsawa, TIzawa, T A novel series of 4-phenoxyquinolines: potent and highly selective inhibitors of PDGF receptor autophosphorylation Bioorg Med Chem Lett7:2935-2940 (1997)    Article
 
Epidermal growth factor receptor
Name:Epidermal growth factor receptor
Type:Receptor Kinase Domain
Mol. Mass.:134279.59
Organism:Homo sapiens (Human)
Description:P00533
Residue:1210
BDBM50290834
NameBDBM50290834
Synonyms:4-(3,4-Dimethoxy-phenoxy)-6,7-dimethoxy-quinoline | CHEMBL327300
TypeSmall organic molecule
Emp. Form.C19H19NO5
Mol. Mass.341.3579
SMILESCOc1ccc(Oc2ccnc3cc(OC)c(OC)cc23)cc1OC