Reaction Details
TargetProtein kinase C delta type
LigandBDBM50290874
Substrate/Competitorn/a
Meas. Tech.ChEBML_160790
Ki 6500±n/a nM
Citation Endo, YHirano, MDriedger, PEStabel, SShudo, K Novel conformationally constrained analogues of diacylglycerol. Protein kinase C binding affinity of simplified compounds based on a 6-membered lactam moiety Bioorg Med Chem Lett7:2997-3000 (1997)    Article
 
Protein kinase C delta type
Name:Protein kinase C delta type
Type:Enzyme
Mol. Mass.:77516.79
Organism:Homo sapiens (Human)
Description:The recombinant human PKC enzymes were produced using a baculovirus expression system in SF9 cells
Residue:676
BDBM50290874
NameBDBM50290874
Synonyms:(3R,6S)-6-Hydroxymethyl-3-isopropyl-4-tetradecyl-piperazin-2-one | CHEMBL103658
TypeSmall organic molecule
Emp. Form.C22H44N2O2
Mol. Mass.368.597
1C[C@@H](CO)NC(=O)[C@H]1C(C)C