Reaction Details
TargetKappa-type opioid receptor
LigandBDBM50290974
Substrate/Competitorn/a
Meas. Tech.ChEBML_145675
EC50>10000±n/a nM
Citation Sabin, VHorwell, DCMcKnight, ATBroqua, P trans N-Methyl-N-[2-(1-pyrrolidinyl)cyclohexyl] cycloprop-2-ene-1-carboxamides: Novel lipophilic kappa opioid agonists Bioorg Med Chem Lett7:291-296 (1997)    Article
 
Kappa-type opioid receptor
Name:Kappa-type opioid receptor
Type:G Protein-Coupled Receptor (GPCR)
Mol. Mass.:42648.76
Organism:Homo sapiens (Human)
Description:P41145
Residue:380
BDBM50290974
NameBDBM50290974
Synonyms:CHEMBL327944 | N-Methyl-2,2-diphenyl-N-((1S,2S)-2-pyrrolidin-1-yl-cyclohexyl)-acetamide
TypeSmall organic molecule
Emp. Form.C25H32N2O
Mol. Mass.376.5344
SMILESCN([C@H]1CCCC[C@@H]1N1CCCC1)C(=O)C(c1ccccc1)c1ccccc1