Reaction Details
TargetKappa-type opioid receptor
LigandBDBM50290978
Substrate/Competitorn/a
Meas. Tech.ChEBML_145675
EC50 141±n/a nM
Citation Sabin, VHorwell, DCMcKnight, ATBroqua, P trans N-Methyl-N-[2-(1-pyrrolidinyl)cyclohexyl] cycloprop-2-ene-1-carboxamides: Novel lipophilic kappa opioid agonists Bioorg Med Chem Lett7:291-296 (1997)    Article
 
Kappa-type opioid receptor
Name:Kappa-type opioid receptor
Type:G Protein-Coupled Receptor (GPCR)
Mol. Mass.:42648.76
Organism:Homo sapiens (Human)
Description:P41145
Residue:380
BDBM50290978
NameBDBM50290978
Synonyms:2-(3-Chloro-phenyl)-3-phenyl-cycloprop-2-enecarboxylic acid methyl-((1S,2S)-2-pyrrolidin-1-yl-cyclohexyl)-amide | CHEMBL100994
TypeSmall organic molecule
Emp. Form.C27H31ClN2O
Mol. Mass.435.001
SMILESCN([C@H]1CCCC[C@@H]1N1CCCC1)C(=O)C1C(=C1c1cccc(Cl)c1)c1ccccc1