Reaction Details
TargetLanosterol synthase
LigandBDBM50290988
Substrate/Competitorn/a
Meas. Tech.ChEMBL_148883 (CHEMBL753758)
Ki 2500±n/a nM
Citation Madden, BAPrestwich, GD Potency and inactivation rates of analogues of an irreversible inhibitor of vertebrate oxidosqualene cyclase Bioorg Med Chem Lett7:309-314 (1997)    Article
 
Lanosterol synthase
Name:Lanosterol synthase
Type:PROTEIN
Mol. Mass.:83302.12
Organism:Rattus norvegicus
Description:ChEMBL_12083
Residue:733
BDBM50290988
NameBDBM50290988
Synonyms:2,2-Dimethyl-3-(3,7,12,20-tetramethyl-16-vinyl-henicosa-3,7,11,15,19-pentaenyl)-oxirane | CHEMBL105938
TypeSmall organic molecule
Emp. Form.C31H50O
Mol. Mass.438.7281
SMILES[#6]\[#6](-[#6])=[#6]/[#6]-[#6]\[#6](-[#6]=[#6])=[#6]\[#6]-[#6]\[#6](-[#6])=[#6]\[#6]-[#6]\[#6]=[#6](/[#6])-[#6]-[#6]\[#6]=[#6](/[#6])-[#6]-[#6]-[#6@@H]1-[#8]C1([#6])[#6]