Reaction Details
TargetMaltase-glucoamylase
LigandBDBM50291034
Substrate/Competitorn/a
Meas. Tech.ChEBML_70932
Ki 70±n/a nM
Citation Lesur, BDucep, JBLalloz, MNEhrhard, ADanzin, C New deoxynojirimycin derivatives as potent inhibitors of intestinal α-glucohydrolases Bioorg Med Chem Lett7:355-360 (1997)    Article
 
Maltase-glucoamylase
Name:Maltase-glucoamylase
Type:Enzyme
Mol. Mass.:209817.06
Organism:Homo sapiens (Human)
Description:O43451
Residue:2753
BDBM50291034
NameBDBM50291034
Synonyms:(2R,3R,4R,5S)-2-Hydroxymethyl-1-(5-trimethylsilanyl-pentyl)-piperidine-3,4,5-triol | CHEMBL120489
TypeSmall organic molecule
Emp. Form.C14H31NO4Si
Mol. Mass.305.4857
SMILESC[Si](C)(C)CCCCCN1C[C@H](O)[C@@H](O)[C@H](O)[C@H]1CO