Reaction Details
TargetGag-Pol polyprotein [489-587]
LigandBDBM50291056
Substrate/Competitorn/a
Meas. Tech.ChEBML_157558
Ki 6±n/a nM
Citation Schwartz, TMBundy, GLStrohbach, JWThaisrivongs, SJohnson, PDSkulnick, HITomich, PKLynn, JCChong, KTHinshaw, RRRaub, TJPadbury, GEToth, LN Synthesis and pharmacological evaluation of sulfone substituted HIV protease inhibitors Bioorg Med Chem Lett7:399-402 (1997)    Article
 
Gag-Pol polyprotein [489-587]
Name:Gag-Pol polyprotein [489-587]
Type:Enzyme Subunit
Mol. Mass.:10781.16
Organism:Human immunodeficiency virus type 1
Description:P04585[489-587]
Residue:99
BDBM50291056
NameBDBM50291056
Synonyms:3-[(3-Benzenesulfonyl-phenyl)-cyclopropyl-methyl]-4-hydroxy-5,6,7,8,9,10-hexahydro-cycloocta[b]pyran-2-one | CHEMBL131658
TypeSmall organic molecule
Emp. Form.C28H30O5S
Mol. Mass.478.6
SMILESOc1c2CCCCCCc2oc(=O)c1C(C1CC1)c1cccc(CS(=O)(=O)c2ccccc2)c1