Reaction Details
TargetEpidermal growth factor receptor
LigandBDBM50291107
Substrate/Competitorn/a
Meas. Tech.ChEBML_63790
IC50 100±n/a nM
Citation Myers, MRSetzer, NNSpada, APPersons, PELy, CQMaguire, MPZulli, ALCheney, DLZilberstein, AJohnson, SEFranks, CFMitchell, KJ The synthesis and SAR of new 4-(N-alkyl-N-phenyl)amino-6,7-dimethoxyquinazolines and 4-(N-alkyl-N-phenyl)aminopyrazolo[3,4-Bioorg Med Chem Lett7:421-424 (1997)    Article
 
Epidermal growth factor receptor
Name:Epidermal growth factor receptor
Type:Receptor Kinase Domain
Mol. Mass.:134279.59
Organism:Homo sapiens (Human)
Description:P00533
Residue:1210
BDBM50291107
NameBDBM50291107
Synonyms:(3-Chloro-phenyl)-(6,7-dimethoxy-quinazolin-4-yl)-methyl-amine; hydrochloride | CHEMBL553908
TypeSmall organic molecule
Emp. Form.C17H16ClN3O2
Mol. Mass.329.781
SMILESCOc1cc2ncnc(N(C)c3cccc(Cl)c3)c2cc1OC