Reaction Details
TargetEpidermal growth factor receptor
LigandBDBM50291116
Substrate/Competitorn/a
Meas. Tech.ChEBML_63790
IC50 4000±n/a nM
Citation Myers, MRSetzer, NNSpada, APPersons, PELy, CQMaguire, MPZulli, ALCheney, DLZilberstein, AJohnson, SEFranks, CFMitchell, KJ The synthesis and SAR of new 4-(N-alkyl-N-phenyl)amino-6,7-dimethoxyquinazolines and 4-(N-alkyl-N-phenyl)aminopyrazolo[3,4-Bioorg Med Chem Lett7:421-424 (1997)    Article
 
Epidermal growth factor receptor
Name:Epidermal growth factor receptor
Type:Receptor Kinase Domain
Mol. Mass.:134279.59
Organism:Homo sapiens (Human)
Description:P00533
Residue:1210
BDBM50291116
NameBDBM50291116
Synonyms:(6,7-Dimethoxy-quinazolin-4-yl)-methyl-p-tolyl-amine; hydrochloride | CHEMBL545538
TypeSmall organic molecule
Emp. Form.C18H19N3O2
Mol. Mass.309.3624
SMILESCOc1cc2ncnc(N(C)c3ccc(C)cc3)c2cc1OC