Reaction Details
TargetEpidermal growth factor receptor
LigandBDBM3530
Substrate/Competitorn/a
Meas. Tech.ChEBML_63790
IC50 50±n/a nM
Citation Myers, MRSetzer, NNSpada, APPersons, PELy, CQMaguire, MPZulli, ALCheney, DLZilberstein, AJohnson, SEFranks, CFMitchell, KJ The synthesis and SAR of new 4-(N-alkyl-N-phenyl)amino-6,7-dimethoxyquinazolines and 4-(N-alkyl-N-phenyl)aminopyrazolo[3,4-Bioorg Med Chem Lett7:421-424 (1997)    Article
 
Epidermal growth factor receptor
Name:Epidermal growth factor receptor
Type:Receptor Kinase Domain
Mol. Mass.:134279.59
Organism:Homo sapiens (Human)
Description:P00533
Residue:1210
BDBM3530
NameBDBM3530
Synonyms:6,7-dimethoxy-N-phenylquinazolin-4-amine CHEMBL94191 | PD153035 Analog 29
TypeSmall organic molecule
Emp. Form.C16H15N3O2
Mol. Mass.281.3092
SMILESCOc1cc2ncnc(Nc3ccccc3)c2cc1OC