Reaction Details
TargetInterleukin-8
LigandBDBM50291128
Substrate/Competitorn/a
Meas. Tech.ChEBML_89094
Ki 13000±n/a nM
Citation Attwood, MRConway, EADunsdon, RMGreening, JRHanda, BKJones, PSJordan, SCKeech, EWilson, FX Peptide based inhibitors of interleukin-8: structural simplification and enhanced potency Bioorg Med Chem Lett7:429-432 (1997)    Article
 
Interleukin-8
Name:Interleukin-8
Type:PROTEIN
Mol. Mass.:11104.05
Organism:Homo sapiens (Human)
Description:ChEMBL_577736
Residue:99
BDBM50291128
NameBDBM50291128
Synonyms:CHEMBL267749 Interleukin-8 inhibitor, 7
TypeSmall organic molecule
Emp. Form.C111H149N23O36S2
Mol. Mass.2445.633
SMILESCSCC[C@H](NC(C)=O)C(=O)N[C@@H](Cc1c[nH]c2ccccc12)C(=O)N[C@@H](CC(O)=O)C(=O)N[C@@H](Cc1ccccc1)C(=O)N[C@@H](CC(O)=O)C(=O)N[C@@H](CC(O)=O)C(=O)N[C@@H](CC(C)C)C(=O)N[C@@H](CC(N)=O)C(=O)N[C@@H](Cc1ccccc1)C(=O)NCCCCC(=O)N[C@@H](CCSC)C(=O)N1CCC[C@H]1C(=O)N1CCC[C@H]1C(=O)N[C@@H](C)C(=O)N[C@@H](CC(O)=O)C(=O)N[C@@H](CCC(O)=O)C(=O)N[C@@H](CC(O)=O)C(=O)N[C@@H](Cc1ccc(O)cc1)C(=O)N[C@@H](CO)C(=O)N1CCC[C@H]1C(N)=O