Reaction Details
TargetCalpain-1 catalytic subunit
LigandBDBM50291187
Substrate/Competitorn/a
Meas. Tech.ChEBML_43860
IC50 11±n/a nM
Citation Iqbal, MMessina, PAFreed, BDas, MChatterjee, STripathy, RTao, MJosef, KADembofsky, BDunn, DGriffith, ESiman, RSenadhi, SEBiazzo, WBozyczko-Coyne, DMeyer, SLAtor, MABihovsky, R Subsite requirements for peptide aldehyde inhibitors of human calpain I Bioorg Med Chem Lett7:539-544 (1997)    Article
 
Calpain-1 catalytic subunit
Name:Calpain-1 catalytic subunit
Type:Protein
Mol. Mass.:81880.51
Organism:Homo sapiens (Human)
Description:n/a
Residue:714
BDBM50291187
NameBDBM50291187
Synonyms:CHEMBL151370 | {(S)-1-[(R)-1-((R)-1-Formyl-3-methyl-butylcarbamoyl)-3-methyl-butylcarbamoyl]-2-phenyl-ethyl}-carbamic acid benzyl ester
TypeSmall organic molecule
Emp. Form.C29H39N3O5
Mol. Mass.509.6371
SMILESCC(C)C[C@@H](NC(=O)[C@@H](CC(C)C)NC(=O)[C@H](Cc1ccccc1)NC(=O)OCc1ccccc1)C=O