Reaction Details
TargetMucosal addressin cell adhesion molecule 1
LigandBDBM50070605
Substrate/Competitorn/a
Meas. Tech.ChEBML_100378
IC50 276000±n/a nM
Citation Carson, KGSchwender, CFShroff, HNCochran, NAGallant, DLBriskin, MJ Sulfonopeptide inhibitors of leukocyte adhesion Bioorg Med Chem Lett7:711-714 (1997)    Article
 
Mucosal addressin cell adhesion molecule 1
Name:Mucosal addressin cell adhesion molecule 1
Type:PROTEIN
Mol. Mass.:40144.71
Organism:Homo sapiens (Human)
Description:ChEMBL_100378
Residue:382
BDBM50070605
NameBDBM50070605
Synonyms:(S)-3-((S)-2-Acetylamino-4-methyl-pentanoylamino)-N-((1S,2R)-1-carbamoyl-2-hydroxy-propyl)-succinamic acid | CHEMBL289974
TypeSmall organic molecule
Emp. Form.C16H28N4O7
Mol. Mass.388.4161
SMILESCC(C)C[C@H](NC(C)=O)C(=O)N[C@@H](CC(O)=O)C(=O)N[C@@H]([C@@H](C)O)C(N)=O