Reaction Details
TargetMucosal addressin cell adhesion molecule 1
LigandBDBM50291324
Substrate/Competitorn/a
Meas. Tech.ChEBML_100378
IC50 219000±n/a nM
Citation Carson, KGSchwender, CFShroff, HNCochran, NAGallant, DLBriskin, MJ Sulfonopeptide inhibitors of leukocyte adhesion Bioorg Med Chem Lett7:711-714 (1997)    Article
 
Mucosal addressin cell adhesion molecule 1
Name:Mucosal addressin cell adhesion molecule 1
Type:PROTEIN
Mol. Mass.:40144.71
Organism:Homo sapiens (Human)
Description:ChEMBL_100378
Residue:382
BDBM50291324
NameBDBM50291324
Synonyms:4-((S)-2-Acetylamino-4-methyl-pentanoylamino)-3-((S)-1-carbamoyl-2-methyl-propylsulfamoyl)-butyric acid | CHEMBL163157
TypeSmall organic molecule
Emp. Form.C17H32N4O7S
Mol. Mass.436.524
SMILESCC(C)C[C@H](NC(C)=O)C(=O)NCC(CC(O)=O)S(=O)(=O)N[C@@H](C(C)C)C(N)=O