Reaction Details
TargetMucosal addressin cell adhesion molecule 1
LigandBDBM50291325
Substrate/Competitorn/a
Meas. Tech.ChEBML_100378
IC50 126000±n/a nM
Citation Carson, KGSchwender, CFShroff, HNCochran, NAGallant, DLBriskin, MJ Sulfonopeptide inhibitors of leukocyte adhesion Bioorg Med Chem Lett7:711-714 (1997)    Article
 
Mucosal addressin cell adhesion molecule 1
Name:Mucosal addressin cell adhesion molecule 1
Type:PROTEIN
Mol. Mass.:40144.71
Organism:Homo sapiens (Human)
Description:ChEMBL_100378
Residue:382
BDBM50291325
NameBDBM50291325
Synonyms:(S)-3-((S)-2-Acetylamino-4-methyl-pentanoylamino)-N-((S)-1-carbamoyl-2-methyl-propyl)-succinamic acid | CHEMBL162906
TypeSmall organic molecule
Emp. Form.C17H30N4O6
Mol. Mass.386.4433
SMILESCC(C)C[C@H](NC(C)=O)C(=O)N[C@@H](CC(O)=O)C(=O)N[C@@H](C(C)C)C(N)=O