Reaction Details
TargetVasopressin V2 receptor
LigandBDBM35667
Substrate/Competitorn/a
Meas. Tech.ChEBML_211240
IC50 3.3±n/a nM
Citation Moutiez, MLippens, GSergheraert, CTartar, A Vasopressin trisulphide: synthesis, NMR study and affinity studies with V1 and V2 subtypes receptors Bioorg Med Chem Lett7:719-724 (1997)    Article
 
Vasopressin V2 receptor
Name:Vasopressin V2 receptor
Type:PROTEIN
Mol. Mass.:40556.17
Organism:Sus scrofa
Description:ChEMBL_214870
Residue:370
BDBM35667
NameBDBM35667
Synonyms:AVP US10131692, 44 (AVP) [3H]Argipressin tannate | [3H]vasopressin
Typeradiolabeled ligand
Emp. Form.C46H65N15O12S2
Mol. Mass.1084.232
SMILES[#7]-[#6@H]-1-[#6]-[#16]-[#16]-[#6]-[#6@H](-[#7]-[#6](=O)-[#6@H](-[#6]-[#6](-[#7])=O)-[#7]-[#6](=O)-[#6@H](-[#6]-[#6]-[#6](-[#7])=O)-[#7]-[#6](=O)-[#6@H](-[#6]-c2ccccc2)-[#7]-[#6](=O)-[#6@H](-[#6]-c2ccc(-[#8])cc2)-[#7]-[#6]-1=O)-[#6](=O)-[#7]-1-[#6]-[#6]-[#6]-[#6@H]-1-[#6](=O)-[#7]-[#6@@H](-[#6]-[#6]-[#6]\[#7]=[#6](\[#7])-[#7])-[#6](=O)-[#7]-[#6]-[#6](-[#7])=O