Reaction Details
TargetIntegrin alpha-IIb/beta-3
LigandBDBM50291334
Substrate/Competitorn/a
Meas. Tech.ChEMBL_218204 (CHEMBL824553)
IC50 1±n/a nM
Citation Kottirsch, GZerwes, HGCook, NSTapparelli, C Beta-amino acid derivatives as orally active non-peptide fibrinogen receptor antagonists Bioorg Med Chem Lett7:727-732 (1997)    Article
 
Integrin alpha-IIb/beta-3
Name:Integrin alpha-IIb/beta-3
Synonyms:Glycoprotein IIb/IIIa
Type:n/a
Mol. Mass.:n/a
Description:ASSAY_ID of EBI is 30109
Components:This complex has 2 components.
Component 1
Name:Integrin beta-3
Type:Protein
Mol. Mass.:87038.91
Organism:Homo sapiens (Human)
Description:P05106
Residue:788
Component 2
Name:Integrin alpha-IIb
Synonyms:CD_antigen=CD41 GPIIb Glycoprotein IIb ITGA2B Integrin alpha-IIb heavy chain Integrin alpha-IIb light chain, form 2 Integrin alpha-V/beta-3 and alpha-IIb/beta 3 | Platelet membrane glycoprotein IIb
Type:Protein
Mol. Mass.:113354.85
Organism:Homo sapiens (Human)
Description:P08514
Residue:1039
BDBM50291334
NameBDBM50291334
Synonyms:(R)-7-(4-Carbamimidoyl-benzoylamino)-3-[2-(4-methoxy-phenyl)-ethanesulfonylamino]-heptanoic acid | CHEMBL162379
TypeSmall organic molecule
Emp. Form.C24H32N4O6S
Mol. Mass.504.599
SMILESCOc1ccc(CCS(=O)(=O)N[C@H](CCCCNC(=O)c2ccc(cc2)C(N)=N)CC(O)=O)cc1