Reaction Details
TargetProthrombin
LigandBDBM50069297
Substrate/Competitorn/a
Meas. Tech.ChEBML_210597
Ki 1.5±n/a nM
Citation Kim, SHwang, SYKim, YKYun, MOh, YS Rational design of selective thrombin inhibitors Bioorg Med Chem Lett7:769-774 (1997)    Article
 
Prothrombin
Name:Prothrombin
Type:Enzyme
Mol. Mass.:70502.73
Organism:Bos taurus (Bovine)
Description:P00735
Residue:625
BDBM50069297
NameBDBM50069297
Synonyms:1-[3-[4-amino(amineimino)methylphenyl]-2-(2-naphthylsulfonamido)-(2S)-propanoyl]azepane CHEMBL347158
TypeSmall organic molecule
Emp. Form.C26H31N5O3S
Mol. Mass.493.621
SMILESNN=C(N)c1ccc(C[C@H](NS(=O)(=O)c2ccc3ccccc3c2)C(=O)N2CCCCCC2)cc1