Reaction Details
TargetCytosolic phospholipase A2
LigandBDBM50291388
Substrate/Competitorn/a
Meas. Tech.ChEBML_81567
IC50 8000±n/a nM
Citation Springer, DMLuh, BYD'Andrea, SVBronson, JJMansuri, MMBurke, JRGregor, KRStanley, PLTramposch, KM Dicarboxylic acid inhibitors of phospholipase A2 Bioorg Med Chem Lett7:793-798 (1997)    Article
 
Cytosolic phospholipase A2
Name:Cytosolic phospholipase A2
Type:Protein
Mol. Mass.:85219.30
Organism:Homo sapiens (Human)
Description:P47712
Residue:749
BDBM50291388
NameBDBM50291388
Synonyms:3-[(E)-4-(4-Adamantan-1-yl-3-hydroxy-phenyl)-1-((E)-2-carboxy-1-methyl-vinyl)-but-1-enyl]-benzoic acid | CHEMBL444079
TypeSmall organic molecule
Emp. Form.C31H34O5
Mol. Mass.486.5987
SMILESC\C(=C/C(O)=O)\C(=C\CCc1ccc(c(O)c1)C12C[C@H]3C[C@H](C[C@H](C3)C1)C2)\c1cccc(c1)C(O)=O