Reaction Details
TargetCytosolic phospholipase A2
LigandBDBM50291386
Substrate/Competitorn/a
Meas. Tech.ChEBML_81567
IC50 17000±n/a nM
Citation Springer, DMLuh, BYD'Andrea, SVBronson, JJMansuri, MMBurke, JRGregor, KRStanley, PLTramposch, KM Dicarboxylic acid inhibitors of phospholipase A2 Bioorg Med Chem Lett7:793-798 (1997)    Article
 
Cytosolic phospholipase A2
Name:Cytosolic phospholipase A2
Type:Protein
Mol. Mass.:85219.30
Organism:Homo sapiens (Human)
Description:P47712
Residue:749
BDBM50291386
NameBDBM50291386
Synonyms:3-{(E)-3-Carboxy-2-methyl-1-[1-[6-(3-phenyl-propoxy)-naphthalen-2-yl]-meth-(E)-ylidene]-allyl}-benzoic acid | CHEMBL166741
TypeSmall organic molecule
Emp. Form.C32H28O5
Mol. Mass.492.5617
SMILESC\C(=C/C(O)=O)\C(=C\c1ccc2cc(OCCCc3ccccc3)ccc2c1)\c1cccc(c1)C(O)=O