Reaction Details
TargetCytosolic phospholipase A2
LigandBDBM50291389
Substrate/Competitorn/a
Meas. Tech.ChEBML_81567
IC50 4000±n/a nM
Citation Springer, DMLuh, BYD'Andrea, SVBronson, JJMansuri, MMBurke, JRGregor, KRStanley, PLTramposch, KM Dicarboxylic acid inhibitors of phospholipase A2 Bioorg Med Chem Lett7:793-798 (1997)    Article
 
Cytosolic phospholipase A2
Name:Cytosolic phospholipase A2
Type:Protein
Mol. Mass.:85219.30
Organism:Homo sapiens (Human)
Description:P47712
Residue:749
BDBM50291389
NameBDBM50291389
Synonyms:3-{(E)-3-Carbamoyl-2-methyl-1-[1-(5,5,8,8-tetramethyl-5,6,7,8-tetrahydro-anthracen-2-yl)-meth-(E)-ylidene]-allyl}-benzamide | CHEMBL424386
TypeSmall organic molecule
Emp. Form.C31H34N2O2
Mol. Mass.466.6139
SMILESC\C(=C/C(N)=O)\C(=C\c1ccc2cc3c(cc2c1)C(C)(C)CCC3(C)C)\c1cccc(c1)C(N)=O