Reaction Details
TargetNeutrophil collagenase
LigandBDBM50291446
Substrate/Competitorn/a
Meas. Tech.ChEMBL_105206 (CHEMBL713845)
IC50 6±n/a nM
Citation Baxter, ADBird, JBhogal, RMassil, TMinton, KJMontana, JOwen, DA A novel series of matrix metalloproteinase inhibitors for the treatment of inflammatory disorders Bioorg Med Chem Lett7:897-902 (1997)    Article
 
Neutrophil collagenase
Name:Neutrophil collagenase
Type:PROTEIN
Mol. Mass.:53278.33
Organism:Rattus norvegicus
Description:ChEMBL_12591
Residue:466
BDBM50291446
NameBDBM50291446
Synonyms:(R)-2-(2-Mercapto-acetylamino)-N-((S)-1-methylcarbamoyl-2-phenyl-ethyl)-3-methylsulfanyl-propionamide | CHEMBL170913
TypeSmall organic molecule
Emp. Form.C16H23N3O3S2
Mol. Mass.369.502
SMILESCNC(=O)[C@H](Cc1ccccc1)NC(=O)[C@H](CSC)NC(=O)CS