Reaction Details
TargetNeutrophil collagenase
LigandBDBM50291449
Substrate/Competitorn/a
Meas. Tech.ChEMBL_105206 (CHEMBL713845)
IC50 2600±n/a nM
Citation Baxter, ADBird, JBhogal, RMassil, TMinton, KJMontana, JOwen, DA A novel series of matrix metalloproteinase inhibitors for the treatment of inflammatory disorders Bioorg Med Chem Lett7:897-902 (1997)    Article
 
Neutrophil collagenase
Name:Neutrophil collagenase
Type:PROTEIN
Mol. Mass.:53278.33
Organism:Rattus norvegicus
Description:ChEMBL_12591
Residue:466
BDBM50291449
NameBDBM50291449
Synonyms:(S)-4-Methyl-2-(2-methylsulfanyl-acetylamino)-pentanoic acid ((S)-1-methylcarbamoyl-2-phenyl-ethyl)-amide | CHEMBL353472
TypeSmall organic molecule
Emp. Form.C19H29N3O3S
Mol. Mass.379.517
SMILESCNC(=O)[C@H](Cc1ccccc1)NC(=O)[C@H](CC(C)C)NC(=O)CSC