Reaction Details
TargetNeutrophil collagenase
LigandBDBM50291443
Substrate/Competitorn/a
Meas. Tech.ChEMBL_105206 (CHEMBL713845)
IC50 480±n/a nM
Citation Baxter, ADBird, JBhogal, RMassil, TMinton, KJMontana, JOwen, DA A novel series of matrix metalloproteinase inhibitors for the treatment of inflammatory disorders Bioorg Med Chem Lett7:897-902 (1997)    Article
 
Neutrophil collagenase
Name:Neutrophil collagenase
Type:PROTEIN
Mol. Mass.:53278.33
Organism:Rattus norvegicus
Description:ChEMBL_12591
Residue:466
BDBM50291443
NameBDBM50291443
Synonyms:(R)-2-(2-Mercapto-acetylamino)-3-methanesulfinyl-N-((S)-1-methylcarbamoyl-2-phenyl-ethyl)-propionamide | CHEMBL172226
TypeSmall organic molecule
Emp. Form.C16H23N3O4S2
Mol. Mass.385.502
SMILESCNC(=O)[C@H](Cc1ccccc1)NC(=O)[C@H](CS(C)=O)NC(=O)CS