Reaction Details
TargetGlutamate receptor ionotropic, NMDA 2C
LigandBDBM50207594
Substrate/Competitorn/a
Meas. Tech.ChEBML_140490
Ki 33000±n/a nM
Citation Lubisch, WBenl, BHofmann, HP Pyrrolylquinoxalinediones: The importance of pyrrolic substitution on AMPA receptor binding Bioorg Med Chem Lett7:1101-1106 (1997)    Article
 
Glutamate receptor ionotropic, NMDA 2C
Name:Glutamate receptor ionotropic, NMDA 2C
Type:Protein
Mol. Mass.:135305.94
Organism:Rattus norvegicus (Rat)
Description:Q00961
Residue:1237
BDBM50207594
NameBDBM50207594
Synonyms:2,3-Dihydroxy-6-nitro-benzo[f]quinoxaline-7-sulfonic acid amide 2,3-dihydroxy-6-nitro-7-sulfamoylbenzo(f)quinoxaline 6-Nitro-2,3-dioxo-1,2,3,4,4a,10b-hexahydro-benzo[f]quinoxaline-7-sulfonic acid amide 6-Nitro-2,3-dioxo-1,2,3,4-tetrahydro-benzo[f]quinoxaline-7-sulfonic acid amide 6-nitro-2,3-dioxo-1,2,3,4-tetrahydrobenzo[f]quinoxaline-7-sulfonamide | CHEMBL222519
TypeSmall organic molecule
Emp. Form.C12H8N4O6S
Mol. Mass.336.28
SMILESNS(=O)(=O)c1cccc2c1c(cc1[nH]c(=O)c(=O)[nH]c21)[N+]([O-])=O