Reaction Details
TargetNeutrophil elastase
LigandBDBM50291753
Substrate/Competitorn/a
Meas. Tech.ChEBML_63835
Ki 34±n/a nM
Citation Krantz, ASpencer, RWTam, TFThomas, ECopp, LJ. Design of alternate substrate inhibitors of serine proteases. Synergistic use of alkyl substitution to impede enzyme-catalyzed deacylation. J Med Chem30:589-591 (1987) 
 
Neutrophil elastase
Name:Neutrophil elastase
Type:Enzyme
Mol. Mass.:28532.38
Organism:Homo sapiens (Human)
Description:P08246
Residue:267
BDBM50291753
NameBDBM50291753
Synonyms:2-Ethylamino-5-methyl-benzo[d][1,3]oxazin-4-one | CHEMBL142781
TypeSmall organic molecule
Emp. Form.C11H12N2O2
Mol. Mass.204.2252
SMILESCCNc1nc2cccc(C)c2c(=O)o1