Reaction Details
TargetNeutrophil elastase
LigandBDBM50063719
Substrate/Competitorn/a
Meas. Tech.ChEBML_63835
Ki 1.5±n/a nM
Citation Krantz, ASpencer, RWTam, TFThomas, ECopp, LJ. Design of alternate substrate inhibitors of serine proteases. Synergistic use of alkyl substitution to impede enzyme-catalyzed deacylation. J Med Chem30:589-591 (1987) 
 
Neutrophil elastase
Name:Neutrophil elastase
Type:Enzyme
Mol. Mass.:28532.38
Organism:Homo sapiens (Human)
Description:P08246
Residue:267
BDBM50063719
NameBDBM50063719
Synonyms:2-Isopropylamino-5-methyl-benzo[d][1,3]oxazin-4-one | CHEMBL10756
TypeSmall organic molecule
Emp. Form.C12H14N2O2
Mol. Mass.218.2518
SMILESCC(C)Nc1nc2cccc(C)c2c(=O)o1