Reaction Details
TargetAdenosine receptor A1
LigandBDBM50048468
Substrate/Competitorn/a
Meas. Tech.ChEMBL_503060 (CHEMBL983185)
IC50 17±n/a nM
Citation Kuo, YHWu, CH Synthesis of 5-(3-Hydroxypropyl)-7-methoxy-2-(3‘-methoxy-4‘-hydroxyphenyl)-3- benzo[b]furancarbaldehyde, a Novel Adenosine A1 Receptor Ligand from the Root of Salvia miltiorrhiza J Nat Prod59:625-628 (1996)    Article
 
Adenosine receptor A1
Name:Adenosine receptor A1
Type:Enzyme Catalytic Domain
Mol. Mass.:36602.99
Organism:BOVINE
Description:ADENOSINE 0 BOVINE::P28190
Residue:326
BDBM50048468
NameBDBM50048468
Synonyms:2-(4-Hydroxy-3-methoxy-phenyl)-5-(3-hydroxy-propyl)-7-methoxy-benzofuran-3-carbaldehyde CHEMBL42639
TypeSmall organic molecule
Emp. Form.C20H20O6
Mol. Mass.356.3692
SMILESCOc1cc(ccc1O)-c1oc2c(OC)cc(CCCO)cc2c1C=O