Reaction Details
Target3-hydroxy-3-methylglutaryl-coenzyme A reductase
LigandBDBM50004774
Substrate/Competitorn/a
Meas. Tech.ChEMBL_503507 (CHEMBL991179)
Ki 0.6±n/a nM
Citation Patil, ADChan, JALois-Flamberg, PMayer, RJWestley, JW Novel Acetylenic Acids from the Root Bark of Paramacrolobium caeruleum: Inhibitors of 3-Hydroxy-3-methyl-glutaryl Coenzyme A Reductase J Nat Prod52:153-161 (1989)    Article
 
3-hydroxy-3-methylglutaryl-coenzyme A reductase
Name:3-hydroxy-3-methylglutaryl-coenzyme A reductase
Type:Enzyme
Mol. Mass.:97477.10
Organism:Homo sapiens (Human)
Description:P04035
Residue:888
BDBM50004774
NameBDBM50004774
Synonyms:(S)-2-Methyl-butyric acid (1S,3R,7S,8S,8aR)-8-[2-((R)-4-hydroxy-6-oxo-tetrahydro-pyran-2-yl)-ethyl]-3,7-dimethyl-1,2,3,7,8,8a-hexahydro-naphthalen-1-yl ester 2-Methyl-butyric acid 8-[2-(4-hydroxy-6-oxo-tetrahydro-pyran-2-yl)-ethyl]-3,7-dimethyl-1,2,3,7,8,8a-hexahydro-naphthalen-1-yl ester CHEMBL503
TypeSmall organic molecule
Emp. Form.C24H36O5
Mol. Mass.404.5396
SMILESCC[C@H](C)C(=O)O[C@H]1C[C@@H](C)C=C2C=C[C@H](C)[C@H](CCC3C[C@@H](O)CC(=O)O3)[C@@H]12