Reaction Details
TargetD(1A) dopamine receptor
LigandBDBM50292410
Substrate/Competitorn/a
Meas. Tech.ChEMBL_485923 (CHEMBL1013926)
Ki 37±n/a nM
Citation Sweetnam, PMCaldwell, LLancaster, JJr., CBMcMillan, BKinnier, WJPrice, CH The Role of Receptor Binding in Drug Discovery J Nat Prod56:441-455 (1993) 
 
D(1A) dopamine receptor
Name:D(1A) dopamine receptor
Type:Enzyme
Mol. Mass.:49303.43
Organism:Homo sapiens (Human)
Description:P21728
Residue:446
BDBM50292410
NameBDBM50292410
Synonyms:(-)-3-(tert-butyl)-(3S,4aS,13bS)-2,3,4,4a,8,9,13b,14-octahydro-1H-benzo[4,5]cyclohepta[de]pyrido[2,1-a]isoquinolin-3-ol(butaclamol) 3-(tert-butyl)-(3S,4aS,13bS)-2,3,4,4a,8,9,13b,14-octahydro-1H-benzo[4,5]cyclohepta[de]pyrido[2,1-a]isoquinolin-3-ol((-)-butaclamol) CHEMBL479587 | l-Butaclamol
TypeSmall organic molecule
Emp. Form.C25H31NO
Mol. Mass.361.5197
SMILESCC(C)(C)[C@]1(O)CCN2C[C@@H]3c4ccccc4CCc4cccc([C@H]2C1)c34