Reaction Details
TargetSqualene synthase
LigandBDBM50292415
Substrate/Competitorn/a
Meas. Tech.ChEMBL_484347 (CHEMBL999228)
IC50 0.2±n/a nM
Citation Dufresne, CWilson, KESingh, SBZink, DLBergstrom, JDRew, DPolishook, JDMeinz, MHuang, LSilverman, KCLingham, RBMojena, MCascales, CPelaéz, FGibbs, JB Zaragozic Acids D and D2: Potent Inhibitors of Squalene Synthase and of Ras Farnesyl-Protein Transferase J Nat Prod56:1923-1929 (1993) 
 
Squalene synthase
Name:Squalene synthase
Type:PROTEIN
Mol. Mass.:48109.41
Organism:Rattus norvegicus
Description:ChEMBL_1336736
Residue:416
BDBM50292415
NameBDBM50292415
Synonyms:CHEMBL504845 | Zaragozic Acid B
TypeSmall organic molecule
Emp. Form.C39H54O13
Mol. Mass.730.8383
SMILESC\C=C\CCCC\C=C\CCCCC(=O)O[C@@H]1[C@@H](O)[C@]2(CCC(C)C(O)C(C)C\C=C\c3ccccc3)O[C@@]1(C(O)=O)[C@@](O)([C@H](O2)C(O)=O)C(O)=O