Reaction Details
TargetHistamine H3 receptor
LigandBDBM50292430
Substrate/Competitorn/a
Meas. Tech.ChEMBL_481041 (CHEMBL996660)
IC50 9000±n/a nM
Citation Mierzwa, RKing, AConover, MATozzi, SPuar, MSPatel, MCoval, SJPomponi, SA Verongamine, a Novel Bromotyrosine-Derived Histamine H3-Antagonist from the Marine Sponge Verongula gigantea J Nat Prod57:175-177 (1994) 
 
Histamine H3 receptor
Name:Histamine H3 receptor
Type:Enzyme Catalytic Domain
Mol. Mass.:48753.61
Organism:GUINEA PIG
Description:HISTAMINE H3 HRH3 GUINEA PIG::Q9JI35
Residue:445
BDBM50292430
NameBDBM50292430
Synonyms:CHEMBL479515 | aerophobin-1
TypeSmall organic molecule
Emp. Form.C15H16Br2N4O4
Mol. Mass.476.12
SMILESCOC1=C(Br)C(O)C2(CC(=NO2)C(=O)NCCc2cnc[nH]2)C=C1Br