Reaction Details
TargetMuscarinic acetylcholine receptor M2
LigandBDBM50292438
Substrate/Competitorn/a
Meas. Tech.ChEMBL_546429 (CHEMBL1025828)
IC50 6±n/a nM
Citation Hegde, VRSilver, JEPatel, MGGullo, VPDas, PRPuar, MS Isolation and Structure of Two Novel Muscarinic Receptor Antagonists J Nat Prod58:843-847 (1995) 
 
Muscarinic acetylcholine receptor M2
Name:Muscarinic acetylcholine receptor M2
Type:GPCR
Mol. Mass.:51730.61
Organism:Homo sapiens (Human)
Description:P08172
Residue:466
BDBM50292438
NameBDBM50292438
Synonyms:1,-(4-amino-5-oxotridecane-1,13-diyl)diguanidine | CHEMBL477542
TypeSmall organic molecule
Emp. Form.C15H33N7O
Mol. Mass.327.4688
SMILES[#7]-[#6](-[#6]-[#6]-[#6]\[#7]=[#6](\[#7])-[#7])-[#6](=O)-[#6]-[#6]-[#6]-[#6]-[#6]-[#6]-[#6]-[#6]\[#7]=[#6](\[#7])-[#7]