Reaction Details
TargetDNA polymerase beta
LigandBDBM50250356
Substrate/Competitorn/a
Meas. Tech.ChEMBL_546495 (CHEMBL1026664)
IC50 7400±n/a nM
Citation Pengsuparp, TCai, LConstant, HFong, HHLin, LZKinghorn, ADPezzuto, JMCordell, GAIngolfsdöttir, KWagner, HHughes, SH Mechanistic Evaluation of New Plant-Derived Compounds That Inhibit HIV-1 Reverse Transcriptase J Nat Prod58:1024-1031 (1995) 
 
DNA polymerase beta
Name:DNA polymerase beta
Type:Protein
Mol. Mass.:38188.76
Organism:Homo sapiens (Human)
Description:n/a
Residue:335
BDBM50250356
NameBDBM50250356
Synonyms:(+)-protolichesterinic acid protolichesterinic acid
TypeSmall organic molecule
Emp. Form.C19H32O4
Mol. Mass.324.455
SMILESCCCCCCCCCCCCC[C@@H]1OC(=O)C(=C)[C@H]1C(O)=O