Reaction Details
TargetPolyunsaturated fatty acid lipoxygenase ALOX15
LigandBDBM50135851
Substrate/Competitorn/a
Meas. Tech.ChEMBL_546738 (CHEMBL1032552)
IC50 1300±n/a nM
Citation Fu, XSchmitz, FJGovindan, MAbbas, SAHanson, KMHorton, PACrews, PLaney, MSchatzman, RC Enzyme Inhibitors: New and Known Polybrominated Phenols and Diphenyl Ethers from Four Indo-Pacific Dysidea Sponges J Nat Prod58:1384-1391 (1995) 
 
Polyunsaturated fatty acid lipoxygenase ALOX15
Name:Polyunsaturated fatty acid lipoxygenase ALOX15
Type:Protein
Mol. Mass.:74804.05
Organism:Homo sapiens (Human)
Description:n/a
Residue:662
BDBM50135851
NameBDBM50135851
Synonyms:2,3,4,5-tetrabromo-6-(3,5-dibromo-2-hydroxy-phenoxy)-phenol CHEMBL150098
TypeSmall organic molecule
Emp. Form.C12H4Br6O3
Mol. Mass.675.582
SMILESOc1c(Br)cc(Br)cc1Oc1c(O)c(Br)c(Br)c(Br)c1Br