Reaction Details
TargetEndothelin-1 receptor
LigandBDBM50292476
Substrate/Competitorn/a
Meas. Tech.ChEMBL_507943 (CHEMBL937906)
IC50 400000±n/a nM
Citation Hussain, RADickey, JKRosser, MPMatson, JAKozlowski, MRBrittain, RJWebb, MLRose, PMFernandes, P A Novel Class of Non-Peptidic Endothelin Antagonists Isolated from the Medicinal Herb Phyllanthus niruri J Nat Prod58:1515-1520 (1995)    Article
 
Endothelin-1 receptor
Name:Endothelin-1 receptor
Type:Enzyme Catalytic Domain
Mol. Mass.:48256.91
Organism:RAT
Description:ENDOTHELIN A EDNRA RAT::P26684
Residue:426
BDBM50292476
NameBDBM50292476
Synonyms:CHEMBL453822 | nirtetralin
TypeSmall organic molecule
Emp. Form.C24H30O7
Mol. Mass.430.4908
SMILESCOC[C@@H]1Cc2cc3OCOc3c(OC)c2[C@@H]([C@H]1COC)c1ccc(OC)c(OC)c1