Reaction Details
TargetEpidermal growth factor receptor
LigandBDBM3973
Substrate/Competitorn/a
Meas. Tech.ChEMBL_506208 (CHEMBL941412)
IC50 3060±n/a nM
Citation Chang, CJGeahlen, RL Protein-Tyrosine Kinase Inhibition: Mechanism-Based Discovery of Antitumor Agents J Nat Prod55:1529-1560 (1992) 
 
Epidermal growth factor receptor
Name:Epidermal growth factor receptor
Type:Receptor Kinase Domain
Mol. Mass.:134279.59
Organism:Homo sapiens (Human)
Description:P00533
Residue:1210
BDBM3973
NameBDBM3973
Synonyms:N-[(E)-2-(2,5-dihydroxyphenyl)ethenyl]formamide erbstatin
TypeSmall organic molecule
Emp. Form.C9H9NO3
Mol. Mass.179.1727
SMILESOc1ccc(O)c(\C=C\NC=O)c1